BDBM286549 US9566312, Compound 2.5.30
SMILES CC[C@@H]1NC(=O)[C@H]([C@H](O)[C@H](C)C\C=C\C)N(C)C(=O)[C@H](C(C)C)N(C)C(=O)[C@H](CC(C)C)N(C)C(=O)[C@H](CC(C)C)N(C)C(=O)[C@@H](C)NC(=O)[C@H](C)NC(=O)[C@H](CC(C)C)N(C)C(=O)[C@@H](NC(=O)[C@H]([C@H](C)CN2CCNC(=O)C2)N(C)C(=O)[C@@H](C)N(C)C1=O)C(C)C
InChI Key InChIKey=CRGCAKYXIPNDCW-RRZLEUKXSA-N
Data  3 Kd
  Tab Delimited (TSV)   2D SDfile   Computed 3D by Vconf -m prep SDfile
Find this compound or compounds like it in BindingDB:
Activity Spreadsheet -- Enzyme Inhibition Constant Data from BindingDB
Found 3 hits for monomerid = 286549
TargetPeptidyl-prolyl cis-trans isomerase A(Homo sapiens (Human))
Novartis
US Patent
LigandPNGBDBM286549(US9566312, Compound 2.5.30)
Affinity DataKd:  1.70nMpH: 7.4Assay Description:Binding of inhibitors to expressed cyclophilins was determined using surface plasmon resonance (SPR) experiments. Briefly, avi-tagged cyclophilin pro...
Ligand InfoPC cidPC sid
In DepthDetails US Patent
TargetPeptidyl-prolyl cis-trans isomerase F, mitochondrial(Homo sapiens (Human))
Novartis
US Patent
LigandPNGBDBM286549(US9566312, Compound 2.5.30)
Affinity DataKd:  1.10nMpH: 7.4Assay Description:Binding of inhibitors to expressed cyclophilins was determined using surface plasmon resonance (SPR) experiments. Briefly, avi-tagged cyclophilin pro...
Ligand InfoPC cidPC sid
In DepthDetails US Patent
TargetPeptidyl-prolyl cis-trans isomerase B(Homo sapiens (Human))
Novartis
US Patent
LigandPNGBDBM286549(US9566312, Compound 2.5.30)
Affinity DataKd:  1nMpH: 7.4Assay Description:Binding of inhibitors to expressed cyclophilins was determined using surface plasmon resonance (SPR) experiments. Briefly, avi-tagged cyclophilin pro...
Ligand InfoPC cidPC sid
In DepthDetails US Patent