BDBM287100 N-(1-(2- (Diisopropylamino)ethyl)- 1H-pyrazolo[3,4- d]pyrimidin-4-yl)-1- adamantylcarboxamide maleate::US9567338, 18
SMILES CC(C)N(CCn1ncc2c(NC(=O)C34CC5CC(CC(C5)C3)C4)ncnc12)C(C)C
InChI Key InChIKey=DTWXCKJWLVQYAI-UHFFFAOYSA-N
Data  1 KI
  Tab Delimited (TSV)   2D SDfile   Computed 3D by Vconf -m prep SDfile
Find this compound or compounds like it in BindingDB:
Activity Spreadsheet -- Enzyme Inhibition Constant Data from BindingDB
Found 1 hit for monomerid = 287100
TargetSigma non-opioid intracellular receptor 1(Cavia porcellus (Guinea pig))
Laboratorios Del Dr. Esteve
US Patent
LigandPNGBDBM287100(N-(1-(2- (Diisopropylamino)ethyl)- 1H-pyrazolo[3,4...)
Affinity DataKi:  56.7nMpH: 7.4Assay Description:Brain membrane preparation and binding assays for the σ1-receptor were performed as described (DeHaven-Hudkins, D. L., L. C. Fleissner, and F. Y...
Ligand InfoPC cidPC sid
In DepthDetails US Patent