BDBM287791 6-(5,11-dihydro-6H- pyrido[2,3-b] [1,5]benzodiazepin-6- ylcarbonyl)spiro[3.3]heptane- 2-carboxylic acid::US10086000, Example 9::US10508108, Example 9
SMILES OC(=O)C1CC2(C1)CC(C2)C(=O)N1Cc2cccnc2Nc2ccccc12
InChI Key InChIKey=DQEKQIMBUUOBKX-UHFFFAOYSA-N
Data  2 IC50
  Tab Delimited (TSV)   2D SDfile   Computed 3D by Vconf -m prep SDfile
Find this compound or compounds like it in BindingDB:
Activity Spreadsheet -- Enzyme Inhibition Constant Data from BindingDB
Found 1 hit for monomerid = 287791
TargetIsocitrate dehydrogenase [NADP] cytoplasmic [R132H](Homo sapiens (Human))
Merck Sharp & Dohme
US Patent
LigandPNGBDBM287791(6-(5,11-dihydro-6H- pyrido[2,3-b] [1,5]benzodiaze...)
Affinity DataIC50:  3.94E+4nM. Assay description: Each test compound (10 mM stock in DMSO) is diluted in DMSO to make a 10-point, 3-fold dilution series. 125 nL of each dilution or DMSO alone is disp...
Ligand InfoPC cidPC sid
In DepthDetails US Patent