BDBM289374 US10093660, Example 9.9
SMILES COc1cc(cc2ncnc(Nc3ccc(F)cc3O[C@H]3COC[C@@H]3O)c12)N=S(C)(=O)C(C)C
InChI Key InChIKey=LVNVVQGFTJCJNJ-NVFIWAGISA-N
Data  1 IC50
  Tab Delimited (TSV)   2D SDfile   Computed 3D by Vconf -m prep SDfile
Find this compound or compounds like it in BindingDB:
Activity Spreadsheet -- Enzyme Inhibition Constant Data from BindingDB
Found 1 hit for monomerid = 289374
TargetMAP kinase-interacting serine/threonine-protein kinase 2(Homo sapiens (Human))
Evotec Internatonal
US Patent
LigandPNGBDBM289374(US10093660, Example 9.9)
Affinity DataIC50:  7nMT: 2°C. Assay description: ASSAY SETUP: The inhibition of kinase activity of MNK2a was assessed using pre-activated GST-MNK2a. The white, 384-well OptiPlate F plates were purch...
Ligand InfoPC cidPC sid
In DepthDetails US Patent