BDBM289452 US10093663, Example 17-4
SMILES COc1cc(ccc1C1CCCCN1Cc1c(cc(C)c2[nH]ccc12)C1CC1)C(O)=O
InChI Key
Data  1 IC50
  Tab Delimited (TSV)   2D SDfile   Computed 3D by Vconf -m prep SDfile
Find this compound or compounds like it in BindingDB:
Activity Spreadsheet -- Enzyme Inhibition Constant Data from BindingDB
Found 1 hit for monomerid = 289452
TargetComplement factor B(Homo sapiens (Human))
Novartis
US Patent
LigandPNGBDBM289452(US10093663, Example 17-4)
Affinity DataIC50:  87nMpH: 7.4 T: 2°C. Assay description: CVF-Bb complex prepared from purified cobra venom factor (1 μM), recombinant human complement factor B (expressed in drosophila cells and purifi...
Ligand InfoPC cidPC sid
In DepthDetails US Patent