BDBM289497 US10093663, Example 27-1b
SMILES COC1CCN(Cc2c(C)cc(C)c3[nH]ccc23)[C@H](C1)c1ccc(cc1)C(O)=O
InChI Key
Data  1 IC50
  Tab Delimited (TSV)   2D SDfile   Computed 3D by Vconf -m prep SDfile
Find this compound or compounds like it in BindingDB:
Activity Spreadsheet -- Enzyme Inhibition Constant Data from BindingDB
Found 1 hit for monomerid = 289497
TargetComplement factor B(Homo sapiens (Human))
Novartis
US Patent
LigandPNGBDBM289497(US10093663, Example 27-1b)
Affinity DataIC50:  22nMpH: 7.4 T: 2°C. Assay description: CVF-Bb complex prepared from purified cobra venom factor (1 μM), recombinant human complement factor B (expressed in drosophila cells and purifi...
Ligand InfoPC cidPC sid
In DepthDetails US Patent