BDBM289559 8-((4-Hydroxypiperidin-1-yl)methyl)-6-(4-methoxybenzyl)-9-methylthieno[3,2-e][1,2,4]triazolo[1,5-c]pyrimidin-5(6H)-one::US10092575, Example 47::US10376514, Example 47
SMILES COc1ccc(Cn2c3sc(CN4CCC(O)CC4)c(C)c3c3ncnn3c2=O)cc1
InChI Key InChIKey=CCIZLYAPHABSBK-UHFFFAOYSA-N
Data  2 IC50  1 EC50
  Tab Delimited (TSV)   2D SDfile   Computed 3D by Vconf -m prep SDfile
Find this compound or compounds like it in BindingDB:
Activity Spreadsheet -- Enzyme Inhibition Constant Data from BindingDB
Found 1 hit for monomerid = 289559
TargetDual specificity calcium/calmodulin-dependent 3',5'-cyclic nucleotide phosphodiesterase 1B(Homo sapiens (Human))
Dart Neuroscience (Cayman)
US Patent
LigandPNGBDBM289559(8-((4-Hydroxypiperidin-1-yl)methyl)-6-(4-methoxybe...)
Affinity DataEC50: <100nMT: 2°C. Assay description: The IMAP TR-FRET PDE assay was optimized for concentration of enzyme, Calmodulin, cAMP or cGMP substrate, DMSO tolerance, and incubation time. Into e...
Ligand InfoPC cidPC sid
In DepthDetails US Patent