BDBM292006 US10100030, Example 1
SMILES CN(C(=O)C(C)(C)c1cc(cc(c1)C(F)(F)F)C(F)(F)F)c1cnc(cc1-c1ccc(F)cc1C)N1CCC(CC(O)=O)CC1
InChI Key InChIKey=HFWXBUXIGDHRIC-UHFFFAOYSA-N
Data  2 IC50
  Tab Delimited (TSV)   2D SDfile   Computed 3D by Vconf -m prep SDfile
Find this compound or compounds like it in BindingDB:
Activity Spreadsheet -- Enzyme Inhibition Constant Data from BindingDB
Found 2 hits for monomerid = 292006
TargetCytochrome P450 3A4(Homo sapiens (Human))
Kissei Pharmaceutical
US Patent
LigandPNGBDBM292006(US10100030, Example 1)
Affinity DataIC50:  6.20E+3nMpH: 7.4 T: 2°C. Assay description: A dimethyl sulfoxide (DMSO) solution of a test compound with a concentration 1000 times higher than the evaluation concentration was prepared, and a ...
Ligand InfoPC cidPC sid
In DepthDetails US Patent
TargetSubstance-P receptor(Homo sapiens (Human))
Kissei Pharmaceutical
US Patent
LigandPNGBDBM292006(US10100030, Example 1)
Affinity DataIC50:  2.11nMpH: 7.4 T: 2°C. Assay description: The buffer solution for the receptor binding test was dispensed to the wells of a 96-well assay plate (Greiner) at 22.5 uL/well. DMSO solutions of a ...
Ligand InfoPC cidPC sid
In DepthDetails US Patent