BDBM293399 US10106521, Compound 9-O-Benzyl Eckol
SMILES Oc1cc(O)cc(Oc2c(O)cc(O)c3Oc4cc(O)cc(OCc5ccccc5)c4Oc23)c1
InChI Key InChIKey=ZABXYXPRTUBQOW-UHFFFAOYSA-N
Data  2 IC50
  Tab Delimited (TSV)   2D SDfile   Computed 3D by Vconf -m prep SDfile
Find this compound or compounds like it in BindingDB:
Activity Spreadsheet -- Enzyme Inhibition Constant Data from BindingDB
Found 2 hits for monomerid = 293399
TargetCholinesterase(Homo sapiens (Human))
Phloronol
US Patent
LigandPNGBDBM293399(US10106521, Compound 9-O-Benzyl Eckol)
Affinity DataIC50:  8.60E+3nMpH: 7.4 T: 2°C. Assay description: Enzyme activities were determined at room temperature. Ultraviolet absorbance was measured spectrophotometrically by a modification of a previously d...
Ligand InfoPC cidPC sid
In DepthDetails US Patent
TargetAcetylcholinesterase(Homo sapiens (Human))
Phloronol
US Patent
LigandPNGBDBM293399(US10106521, Compound 9-O-Benzyl Eckol)
Affinity DataIC50:  4.01E+4nMpH: 7.4 T: 2°C. Assay description: Enzyme activities were determined at room temperature. Ultraviolet absorbance was measured spectrophotometrically by a modification of a previously d...
Ligand InfoPC cidPC sid
In DepthDetails US Patent