BDBM293839 3-({[(1R)-6-{methyl[4-(trifluoromethoxy)phenyl]amino}-1,2,3,4-::US10106534, Example 181
SMILES CN(c1ccc(OC(F)(F)F)cc1)c1ccc2[C@H](CNc3cnccc3C(O)=O)CCCc2c1
InChI Key InChIKey=DTVHOSSZTJYEMU-KRWDZBQOSA-N
Data  1 IC50
  Tab Delimited (TSV)   2D SDfile   Computed 3D by Vconf -m prep SDfile
Find this compound or compounds like it in BindingDB:
Activity Spreadsheet -- Enzyme Inhibition Constant Data from BindingDB
Found 1 hit for monomerid = 293839
TargetLysine-specific demethylase 4C(Homo sapiens (Human))
Celgene Quanticel Research
US Patent
LigandPNGBDBM293839(3-({[(1R)-6-{methyl[4-(trifluoromethoxy)phenyl]ami...)
Affinity DataIC50:  550nMT: 2°C. Assay description: The ability of test compounds to inhibit the activity of JMJD2C was determined in 384-well plate format under the following reaction conditions: 0.3 ...
Ligand InfoPC cidPC sid
In DepthDetails US Patent