BDBM297463 4-({[6-Bromo-3-methyl-2-(5-methyl-2-thienyl)quinolin-4-yl]carbonyl}amino)bicyclo[2.2.2]octane-1-carboxylic acid::US10117864, Example 53
SMILES Cc1ccc(s1)-c1nc2ccc(Br)cc2c(C(=O)NC23CCC(CC2)(CC3)C(O)=O)c1C
InChI Key InChIKey=MUFLFCZZGCYILT-UHFFFAOYSA-N
Data  1 IC50
  Tab Delimited (TSV)   2D SDfile   Computed 3D by Vconf -m prep SDfile
Find this compound or compounds like it in BindingDB:
Activity Spreadsheet -- Enzyme Inhibition Constant Data from BindingDB
Found 1 hit for monomerid = 297463
TargetProstaglandin F2-alpha receptor(Homo sapiens (Human))
Bayer Pharma Aktiengesellschaft
US Patent
LigandPNGBDBM297463(4-({[6-Bromo-3-methyl-2-(5-methyl-2-thienyl)quinol...)
Affinity DataIC50:  235nM. Assay description: For the characterization of test substances in respect of FP antagonism, PGF2α-induced calcium flux in FP-expressing CHEM1 cells (Millipore, HTS...
Ligand InfoPC cidPC sid
In DepthDetails US Patent