BDBM298335 US10123995, Example 13
SMILES OC(=O)c1ccc(NC(=O)C2(O)C[C@@H](F)c3cc(cnc23)-c2cc(Cl)ccc2-n2cnnn2)cc1
InChI Key InChIKey=VDZBJKMWKAGNPT-FKSKYRLFSA-N
Data  2 IC50
  Tab Delimited (TSV)   2D SDfile   Computed 3D by Vconf -m prep SDfile
Find this compound or compounds like it in BindingDB:
Activity Spreadsheet -- Enzyme Inhibition Constant Data from BindingDB
Found 2 hits for monomerid = 298335
TargetCoagulation factor XI(Homo sapiens (Human))
Merck Sharp & Dohme
US Patent
LigandPNGBDBM298335(US10123995, Example 13)
Affinity DataIC50:  202nM. Assay description: The effectiveness of a compound of the present invention as an inhibitor of Kallikrein can be determined using a relevant purified serine protease, a...
Ligand InfoPC cidPC sid
In DepthDetails US Patent
TargetCoagulation factor XI(Homo sapiens (Human))
Merck Sharp & Dohme
US Patent
LigandPNGBDBM298335(US10123995, Example 13)
Affinity DataIC50:  3.70nM. Assay description: The effectiveness of a compound of the present invention as an inhibitor of Coagulation Factor XIa can be determined using a relevant purified serine...
Ligand InfoPC cidPC sid
In DepthDetails US Patent