BDBM299073 3,5-dichloro-N-(6-chloro-4-hydroxypyridazin-3-yl)benzene-1-sulfonamide::US10125125, Example 95
SMILES Oc1cc(Cl)nnc1NS(=O)(=O)c1cc(Cl)cc(Cl)c1
InChI Key InChIKey=DFFIUNTUEDBUST-UHFFFAOYSA-N
Data  1 IC50
  Tab Delimited (TSV)   2D SDfile   Computed 3D by Vconf -m prep SDfile
Find this compound or compounds like it in BindingDB:
Activity Spreadsheet -- Enzyme Inhibition Constant Data from BindingDB
Found 1 hit for monomerid = 299073
TargetProtein S100-A9(Homo sapiens (Human))
Active Biotech
US Patent
LigandPNGBDBM299073(3,5-dichloro-N-(6-chloro-4-hydroxypyridazin-3-yl)b...)
Affinity DataIC50:  700nM. Assay description: Incubation of Biot-hS100A9+Compound Samples and rhRAGE-Fc-Acceptor Beads in OptiplateWhen the biot-hS100A9+ compound incubation is finished the solut...
Ligand InfoPC cidPC sid
In DepthDetails US Patent