BDBM299074 N-(6-chloro-4-hydroxypyridazin-3-yl)-1-(3-chlorophenyl)methanesulfonamide::US10125125, Example 96
SMILES Oc1cc(Cl)nnc1NS(=O)(=O)Cc1cccc(Cl)c1
InChI Key InChIKey=NAIURGMPMYMMCG-UHFFFAOYSA-N
Data  1 IC50
  Tab Delimited (TSV)   2D SDfile   Computed 3D by Vconf -m prep SDfile
Find this compound or compounds like it in BindingDB:
Activity Spreadsheet -- Enzyme Inhibition Constant Data from BindingDB
Found 1 hit for monomerid = 299074
TargetProtein S100-A9(Homo sapiens (Human))
Active Biotech
US Patent
LigandPNGBDBM299074(N-(6-chloro-4-hydroxypyridazin-3-yl)-1-(3-chloroph...)
Affinity DataIC50:  410nM. Assay description: Incubation of Biot-hS100A9+Compound Samples and rhRAGE-Fc-Acceptor Beads in OptiplateWhen the biot-hS100A9+ compound incubation is finished the solut...
Ligand InfoPC cidPC sid
In DepthDetails US Patent