BDBM299076 3-chloro-N-(5-chloro-4-hydroxypyridin-3-yl)-4-(trifluoromethoxy)benzene-1-sulfonamide::US10125125, Example 102
SMILES Oc1c(Cl)cncc1NS(=O)(=O)c1ccc(OC(F)(F)F)c(Cl)c1
InChI Key InChIKey=VQXXUMPJOLUEOK-UHFFFAOYSA-N
Data  1 IC50
  Tab Delimited (TSV)   2D SDfile   Computed 3D by Vconf -m prep SDfile
Find this compound or compounds like it in BindingDB:
Activity Spreadsheet -- Enzyme Inhibition Constant Data from BindingDB
Found 1 hit for monomerid = 299076
TargetProtein S100-A9(Homo sapiens (Human))
Active Biotech
US Patent
LigandPNGBDBM299076(3-chloro-N-(5-chloro-4-hydroxypyridin-3-yl)-4-(tri...)
Affinity DataIC50:  2.20E+3nM. Assay description: Incubation of Biot-hS100A9+Compound Samples and rhRAGE-Fc-Acceptor Beads in OptiplateWhen the biot-hS100A9+ compound incubation is finished the solut...
Ligand InfoPC cidPC sid
In DepthDetails US Patent