BDBM299082 5-bromo-N-(6-chloro-4-hydroxypyridazin-3-yl)-6-methoxypyridine-3-sulfonamide::US10125125, Example 114
SMILES COc1ncc(cc1Br)S(=O)(=O)Nc1nnc(Cl)cc1O
InChI Key InChIKey=VPFWSOVXTMGFBG-UHFFFAOYSA-N
Data  1 IC50
  Tab Delimited (TSV)   2D SDfile   Computed 3D by Vconf -m prep SDfile
Find this compound or compounds like it in BindingDB:
Activity Spreadsheet -- Enzyme Inhibition Constant Data from BindingDB
Found 1 hit for monomerid = 299082
TargetProtein S100-A9(Homo sapiens (Human))
Active Biotech
US Patent
LigandPNGBDBM299082(5-bromo-N-(6-chloro-4-hydroxypyridazin-3-yl)-6-met...)
Affinity DataIC50:  1.00E+3nM. Assay description: Incubation of Biot-hS100A9+Compound Samples and rhRAGE-Fc-Acceptor Beads in OptiplateWhen the biot-hS100A9+ compound incubation is finished the solut...
Ligand InfoPC cidPC sid
In DepthDetails US Patent