BDBM299087 N-(5-chloro-3-hydroxy-6-methanesulfonylpyridin-2-yl)-1-(3,5-dichlorophenyl)-methanesulfonamide::US10125125, Example 134
SMILES CS(=O)(=O)c1nc(NS(=O)(=O)Cc2cc(Cl)cc(Cl)c2)c(O)cc1Cl
InChI Key InChIKey=WIKBRRPRVHIUMK-UHFFFAOYSA-N
Data  1 IC50
  Tab Delimited (TSV)   2D SDfile   Computed 3D by Vconf -m prep SDfile
Find this compound or compounds like it in BindingDB:
Activity Spreadsheet -- Enzyme Inhibition Constant Data from BindingDB
Found 1 hit for monomerid = 299087
TargetProtein S100-A9(Homo sapiens (Human))
Active Biotech
US Patent
LigandPNGBDBM299087(N-(5-chloro-3-hydroxy-6-methanesulfonylpyridin-2-y...)
Affinity DataIC50:  530nM. Assay description: Incubation of Biot-hS100A9+Compound Samples and rhRAGE-Fc-Acceptor Beads in OptiplateWhen the biot-hS100A9+ compound incubation is finished the solut...
Ligand InfoPC cidPC sid
In DepthDetails US Patent