BDBM300278 US9593110, 18-11
SMILES COc1cnc(o1)C(=O)N[C@@H](C[C@@H](N)C(O)=O)Cc1ccc(cc1Cl)-c1cc(Cl)ccc1F
InChI Key InChIKey=VEKSSJZDSFZQAO-RDTXWAMCSA-N
Data  1 KI
  Tab Delimited (TSV)   2D SDfile   Computed 3D by Vconf -m prep SDfile
Find this compound or compounds like it in BindingDB:
Activity Spreadsheet -- Enzyme Inhibition Constant Data from BindingDB
Found 1 hit for monomerid = 300278
TargetNeprilysin(Homo sapiens (Human))
Theravence Biopharma R&D Ip
US Patent
LigandPNGBDBM300278(US9593110, 18-11)
Affinity DataKi: <1nM. Assay description: Recombinant human NEP and recombinant human ACE were obtained commercially (R&D Systems, Minneapolis, Minn., catalog numbers 1182-ZN and 929-ZN, resp...
Ligand InfoPC cidPC sid
In DepthDetails US Patent