BDBM300378 US10130619, Example 68
SMILES C[C@H](Oc1ncc(cc1NCCN1CCOCC1)C(=O)Nc1nnc(s1)-c1ccncc1)c1ccccc1
InChI Key InChIKey=VWJSEVXGWNNPAO-IBGZPJMESA-N
Data  1 KI
  Tab Delimited (TSV)   2D SDfile   Computed 3D by Vconf -m prep SDfile
Find this compound or compounds like it in BindingDB:
Activity Spreadsheet -- Enzyme Inhibition Constant Data from BindingDB
Found 1 hit for monomerid = 300378
TargetNADPH oxidase 1(Homo sapiens (Human))
Genkyotex Suisse
US Patent
LigandPNGBDBM300378(US10130619, Example 68)
Affinity DataKi:  72nM. Assay description: All solutions were placed on ice and protected from light. The final concentration in the 1x hNOX1 membrane fluorescent assay buffer was PBS pH7, 6 &...
Ligand InfoPC cidPC sid
In DepthDetails US Patent