BDBM30061 triazolothiadiazine, 6B
SMILES COc1cccc(c1)-c1nnc2SCC(=Nn12)c1ccccc1OC
InChI Key InChIKey=DFGOHYXSXDNUQO-UHFFFAOYSA-N
Data  1 IC50
  Tab Delimited (TSV)   2D SDfile   Computed 3D by Vconf -m prep SDfile
Find this compound or compounds like it in BindingDB:
Activity Spreadsheet -- Enzyme Inhibition Constant Data from BindingDB
Found 1 hit for monomerid = 30061
LigandPNGBDBM30061(triazolothiadiazine, 6B)
Affinity DataIC50:  1.34E+4nMpH: 7.2 T: 2°C. Assay description: Inhibition of PDE4A was performed using IMAP technology (Molecular Devices, CA). PDE4A1A mixture was dispensed into 1536-well black/solid bottom assa...
In DepthDetails ArticlePubMed