BDBM300818 (3S)-3-(4-((3-(4-(2- Methoxyethoxy)-2- methylphenyl)benzo[b]thiophen- 5-yl)methoxy)phenyl) hex-4-ynoic acid::US10131648, Compound 16::US10195178, Compound 16::US9790198, Compound 16
SMILES COCCOc1ccc(-c2csc3ccc(COc4ccc(cc4)[C@H](CC(O)=O)C#CC)cc23)c(C)c1
InChI Key InChIKey=BZQVEIRHZSHTRF-DEOSSOPVSA-N
Data  3 EC50
  Tab Delimited (TSV)   2D SDfile   Computed 3D by Vconf -m prep SDfile
Find this compound or compounds like it in BindingDB:
Activity Spreadsheet -- Enzyme Inhibition Constant Data from BindingDB
Found 3 hits for monomerid = 300818
TargetFree fatty acid receptor 1(Homo sapiens (Human))
Janssen Pharmaceutica
US Patent
LigandPNGBDBM300818((3S)-3-(4-((3-(4-(2- Methoxyethoxy)-2- methylpheny...)
Affinity DataEC50:  5nM. Assay description: Compounds were tested in a calcium flux assay using transfected HEK293 cells stably expressing either human GPR40 or rat GPR40. Human GPR40 expressin...
Ligand InfoPC cidPC sid
In DepthDetails US Patent
TargetFree fatty acid receptor 1(Homo sapiens (Human))
Janssen Pharmaceutica
US Patent
LigandPNGBDBM300818((3S)-3-(4-((3-(4-(2- Methoxyethoxy)-2- methylpheny...)
Affinity DataEC50:  5nM. Assay description: Compounds were tested in a calcium flux assay using transfected HEK293 cells stably expressing either human GPR40 or rat GPR40. Human GPR40 expressin...
Ligand InfoPC cidPC sid
In DepthDetails US Patent
TargetFree fatty acid receptor 1(Homo sapiens (Human))
Janssen Pharmaceutica
US Patent
LigandPNGBDBM300818((3S)-3-(4-((3-(4-(2- Methoxyethoxy)-2- methylpheny...)
Affinity DataEC50:  5nM. Assay description: Compounds were tested in a calcium flux assay using transfected HEK293 cells stably expressing either human GPR40 or rat GPR40. Human GPR40 expressin...
Ligand InfoPC cidPC sid
In DepthDetails US Patent