BDBM300829 (3S)-3-(4-(((3-(2,6- Dimethylphenyl)benzo[b]thiophen- 5-yl)oxy)methyl)phenyl) hex-4-ynoic acid::US10131648, Compound 27::US10195178, Compound 27::US9790198, Compound 27
SMILES CC#C[C@@H](CC(O)=O)c1ccc(COc2ccc3scc(-c4c(C)cccc4C)c3c2)cc1
InChI Key InChIKey=RZLZOSMVTXLBRN-QHCPKHFHSA-N
Data  3 EC50
  Tab Delimited (TSV)   2D SDfile   Computed 3D by Vconf -m prep SDfile
Find this compound or compounds like it in BindingDB:
Activity Spreadsheet -- Enzyme Inhibition Constant Data from BindingDB
Found 3 hits for monomerid = 300829
TargetFree fatty acid receptor 1(Homo sapiens (Human))
Janssen Pharmaceutica
US Patent
LigandPNGBDBM300829((3S)-3-(4-(((3-(2,6- Dimethylphenyl)benzo[b]thioph...)
Affinity DataEC50:  20nM. Assay description: Compounds were tested in a calcium flux assay using transfected HEK293 cells stably expressing either human GPR40 or rat GPR40. Human GPR40 expressin...
Ligand InfoPC cidPC sid
In DepthDetails US Patent
TargetFree fatty acid receptor 1(Homo sapiens (Human))
Janssen Pharmaceutica
US Patent
LigandPNGBDBM300829((3S)-3-(4-(((3-(2,6- Dimethylphenyl)benzo[b]thioph...)
Affinity DataEC50:  20nM. Assay description: Compounds were tested in a calcium flux assay using transfected HEK293 cells stably expressing either human GPR40 or rat GPR40. Human GPR40 expressin...
Ligand InfoPC cidPC sid
In DepthDetails US Patent
TargetFree fatty acid receptor 1(Homo sapiens (Human))
Janssen Pharmaceutica
US Patent
LigandPNGBDBM300829((3S)-3-(4-(((3-(2,6- Dimethylphenyl)benzo[b]thioph...)
Affinity DataEC50:  20nM. Assay description: Compounds were tested in a calcium flux assay using transfected HEK293 cells stably expressing either human GPR40 or rat GPR40. Human GPR40 expressin...
Ligand InfoPC cidPC sid
In DepthDetails US Patent