BDBM304068 US10138253, Example 5
SMILES C[C@H]1COCCOC2(C)CCN(CC2)c2c([C@H](O)C(O)=O)c(C)c(C)c3nc(cn23)-c2cccc(c2)-c2cc(F)c(F)cc2O1
InChI Key InChIKey=UOVRRPWEEOQBOS-ADSBAMQRSA-N
Data  2 EC50
  Tab Delimited (TSV)   2D SDfile   Computed 3D by Vconf -m prep SDfile
Find this compound or compounds like it in BindingDB:
Activity Spreadsheet -- Enzyme Inhibition Constant Data from BindingDB
Found 2 hits for monomerid = 304068
TargetEnvelope glycoprotein gp160(Human immunodeficiency virus type 1 (isolate BRU/L...)
Viiv Healthcare UK (NO.5)
US Patent
LigandPNGBDBM304068(US10138253, Example 5)
Affinity DataEC50:  283nM. Assay description: A recombinant NL-RLuc proviral clone was constructed in which a section of the nef gene from NL4-3 was replaced with the Renilla Luciferase gene. Thi...
Ligand InfoKEGGPC cidPC sid
In DepthDetails US Patent
TargetEnvelope glycoprotein gp160(Human immunodeficiency virus type 1 (isolate BRU/L...)
Viiv Healthcare UK (NO.5)
US Patent
LigandPNGBDBM304068(US10138253, Example 5)
Affinity DataEC50:  550nM. Assay description: A recombinant NL-RLuc proviral clone was constructed in which a section of the nef gene from NL4-3 was replaced with the Renilla Luciferase gene. Thi...
Ligand InfoKEGGPC cidPC sid
In DepthDetails US Patent