BDBM306538 (1R,8S)-N-[(6-amino-2,4- dimethylpyridin-3-yl)mehtyl]-12- [(4-methyl-1H-pyrazol-1-yl) methyl]-15-oxatetracyclo [6.6.1.02,7.09,14]-pentadeca- 2,4,6,9,11,13- hexaene-4-carboxamide::US10144746, Compound 181
SMILES Cc1cnn(Cc2ccc3[C@@H]4O[C@H](c3c2)c2cc(ccc42)C(=O)NCc2c(C)cc(N)nc2C)c1
InChI Key InChIKey=CPIXSFCYRWRGRW-RRPNLBNLSA-N
Data  1 IC50
  Tab Delimited (TSV)   2D SDfile   Computed 3D by Vconf -m prep SDfile
Find this compound or compounds like it in BindingDB:
Activity Spreadsheet -- Enzyme Inhibition Constant Data from BindingDB
Found 1 hit for monomerid = 306538
TargetPlasma kallikrein(Homo sapiens (Human))
Global Blood Therapeutics
US Patent
LigandPNGBDBM306538((1R,8S)-N-[(6-amino-2,4- dimethylpyridin-3-yl)meht...)
Affinity DataIC50:  1nM. Assay description: The chromogenic substrate D-Pro-Phe-Arg-pNa, 2HCl (BIOPHEN CS-31(02) from Hyphen BioMed, Neuville-Sur-oise, France) was dissolved in 5 mL deionized w...
Ligand InfoPC cidPC sid
In DepthDetails US Patent