BDBM306793 US10149840, Compound SR-4277::US10149840, Series Number 12
SMILES CC1=CC2=NC(CN2C=C1)C(=O)NCCSCc1ccccc1F
InChI Key InChIKey=XLMHULFGKVGKLE-UHFFFAOYSA-N
Data  1 IC50
  Tab Delimited (TSV)   2D SDfile   Computed 3D by Vconf -m prep SDfile
Find this compound or compounds like it in BindingDB:
Activity Spreadsheet -- Enzyme Inhibition Constant Data from BindingDB
Found 1 hit for monomerid = 306793
TargetPOU domain, class 5, transcription factor 1(Homo sapiens (Human))
Shin Nippon Biomedical Laboratories
US Patent
LigandPNGBDBM306793(US10149840, Compound SR-4277 | US10149840, Series ...)
Affinity DataIC50:  8.20E+3nM. Assay description: An existing amount of the OCT3 protein can be estimated from an amount of a compound free in the extracellular fluid in a method similar to a method ...
Ligand InfoPC cidPC sid
In DepthDetails US Patent