BDBM30764 2-amino-1-(3-methoxyphenyl)-N-propyl-3-pyrrolo[3,2-b]quinoxalinecarboxamide::2-amino-1-(3-methoxyphenyl)-N-propyl-pyrrolo[3,2-b]quinoxaline-3-carboxamide::2-amino-1-(3-methoxyphenyl)-N-propylpyrrolo[3,2-b]quinoxaline-3-carboxamide::2-azanyl-1-(3-methoxyphenyl)-N-propyl-pyrrolo[3,2-b]quinoxaline-3-carboxamide::MLS000040876::SMR000043008::cid_662418
SMILES CCCNC(=O)c1c(N)n(-c2cccc(OC)c2)c2nc3ccccc3nc12
InChI Key InChIKey=DXMJTUNVVLBYBJ-UHFFFAOYSA-N
Data  1 EC50
  Tab Delimited (TSV)   2D SDfile   Computed 3D by Vconf -m prep SDfile
Find this compound or compounds like it in BindingDB:
Activity Spreadsheet -- Enzyme Inhibition Constant Data from BindingDB
Found 1 hit for monomerid = 30764
Target5-hydroxytryptamine receptor 1A(Homo sapiens (Human))
The Scripps Research Institute Molecular Screening Center
Curated by PubChem BioAssay
LigandPNGBDBM30764(2-amino-1-(3-methoxyphenyl)-N-propyl-3-pyrrolo[3,2...)
Affinity DataEC50:  2.96E+4nMpH: 7.4 T: 2°C. Assay description: A cell line containing the human 5-HT1a receptor, the promiscuous G-alpha-15 protein (Ga15) as well as the beta-lactamase (BLA) reporter-gene under c...
In DepthDetails PCBioAssay