BDBM307710 (3R)-N-{5-chloro-4-[1-(3-fluorobenzyl)-1H-benzimidazol-6-yl]pyridin-2-yl}piperidine-3-carboxamide::US9650358, Example 6
SMILES Fc1cccc(Cn2cnc3ccc(cc23)-c2cc(NC(=O)[C@@H]3CCCNC3)ncc2Cl)c1
InChI Key InChIKey=RGKGYJUOEFPXPE-GOSISDBHSA-N
Data  1 IC50
  Tab Delimited (TSV)   2D SDfile   Computed 3D by Vconf -m prep SDfile
Find this compound or compounds like it in BindingDB:
Activity Spreadsheet -- Enzyme Inhibition Constant Data from BindingDB
Found 1 hit for monomerid = 307710
TargetCyclin-dependent kinase 9(Homo sapiens (Human))
Abbvie
US Patent
LigandPNGBDBM307710((3R)-N-{5-chloro-4-[1-(3-fluorobenzyl)-1H-benzimid...)
Affinity DataIC50:  27nM. Assay description: CDK9 enzyme activities were measured using LANCE ULight TR-FRET kinase assay reagents (PerkinElmer, Waltham, Mass.). Compounds were directly added in...
Ligand InfoPC cidPC sid
In DepthDetails US Patent