BDBM307833 N-{5-chloro-4-[1-(3-fluorobenzyl)-1H-benzimidazol-6-yl]pyridin-2-yl}-2-(piperidin-4-yl)acetamide::US9650358, Example 129
SMILES Fc1cccc(Cn2cnc3ccc(cc23)-c2cc(NC(=O)CC3CCNCC3)ncc2Cl)c1
InChI Key InChIKey=YJAREEUXYBSYEQ-UHFFFAOYSA-N
Data  1 IC50
  Tab Delimited (TSV)   2D SDfile   Computed 3D by Vconf -m prep SDfile
Find this compound or compounds like it in BindingDB:
Activity Spreadsheet -- Enzyme Inhibition Constant Data from BindingDB
Found 1 hit for monomerid = 307833
TargetCyclin-dependent kinase 9(Homo sapiens (Human))
Abbvie
US Patent
LigandPNGBDBM307833(N-{5-chloro-4-[1-(3-fluorobenzyl)-1H-benzimidazol-...)
Affinity DataIC50:  26nM. Assay description: CDK9 enzyme activities were measured using LANCE ULight TR-FRET kinase assay reagents (PerkinElmer, Waltham, Mass.). Compounds were directly added in...
Ligand InfoPC cidPC sid
In DepthDetails US Patent