BDBM309995 (S)-N-(1-(3-(3-chloro-4-cyanophenyl)-1H-pyrazol-1-yl)propan-2-yl)-2,4,6,7-tetrahydropyrano[4,3-c]pyrazole-3-carboxamide::US9657003, 338
SMILES C[C@@H](Cn1ccc(n1)-c1ccc(C#N)c(Cl)c1)NC(=O)c1[nH]nc2CCOCc12
InChI Key InChIKey=RLNBCGNLCGLNTJ-LBPRGKRZSA-N
Data  1 KI  1 IC50
  Tab Delimited (TSV)   2D SDfile   Computed 3D by Vconf -m prep SDfile
Find this compound or compounds like it in BindingDB:
Activity Spreadsheet -- Enzyme Inhibition Constant Data from BindingDB
Found 2 hits for monomerid = 309995
TargetAndrogen receptor(Homo sapiens (Human))
Orion
US Patent
LigandPNGBDBM309995((S)-N-(1-(3-(3-chloro-4-cyanophenyl)-1H-pyrazol-1-...)
Affinity DataKi:  14nM. Assay description: Androgen receptor (AR) binding affinities of test compounds were studied in cytosolic lysates obtained from ventral prostates of castrated rats by co...
Ligand InfoPC cidPC sid
In DepthDetails US Patent
TargetAndrogen receptor(Homo sapiens (Human))
Orion
US Patent
LigandPNGBDBM309995((S)-N-(1-(3-(3-chloro-4-cyanophenyl)-1H-pyrazol-1-...)
Affinity DataIC50:  42nM. Assay description: Androgen receptor (AR) binding affinities of test compounds were studied in cytosolic lysates obtained from ventral prostates of castrated rats by co...
Ligand InfoPC cidPC sid
In DepthDetails US Patent