BDBM310026 US10544133, Example 29::US9657009, 29
SMILES CC(C)NC(=O)N[C@H](C)CCNC(=O)c1cnc(Nc2ncc(cc2F)C#N)cc1NC(C)C
InChI Key InChIKey=DDVRLWBWJSRZEY-OAHLLOKOSA-N
Data  2 IC50
  Tab Delimited (TSV)   2D SDfile   Computed 3D by Vconf -m prep SDfile
Find this compound or compounds like it in BindingDB:
Activity Spreadsheet -- Enzyme Inhibition Constant Data from BindingDB
Found 1 hit for monomerid = 310026
TargetInterleukin-1 receptor-associated kinase 4(Homo sapiens (Human))
Bristol-Myers Squibb
US Patent
LigandPNGBDBM310026(US10544133, Example 29 | US9657009, 29)
Affinity DataIC50:  1.20nM. Assay description: The assays were performed in U-bottom 384-well plates. The final assay volume was 30 μL prepared from 15 μL additions of enzyme and substra...
Ligand InfoPC cidPC sid
In DepthDetails US Patent