BDBM310028 US9657009, 31
SMILES CC(C)Nc1cc(Nc2ccc(cn2)C#N)ncc1C(=O)NC1CCC(O)(CC1)c1ccnn1C
InChI Key InChIKey=JVHDXMMFWOCHNA-UHFFFAOYSA-N
Data  1 IC50
  Tab Delimited (TSV)   2D SDfile   Computed 3D by Vconf -m prep SDfile
Find this compound or compounds like it in BindingDB:
Activity Spreadsheet -- Enzyme Inhibition Constant Data from BindingDB
Found 1 hit for monomerid = 310028
TargetInterleukin-1 receptor-associated kinase 4(Homo sapiens (Human))
Bristol-Myers Squibb
US Patent
LigandPNGBDBM310028(US9657009, 31)
Affinity DataIC50:  4.60nM. Assay description: The assays were performed in U-bottom 384-well plates. The final assay volume was 30 μL prepared from 15 μL additions of enzyme and substra...
Ligand InfoPC cidPC sid
In DepthDetails US Patent