BDBM311381 (S)-1-((4-chloro-2′-methyl-[2,4′-bipyridin]-5-yl)oxy)-2,4-dimethylpentan-2-amine::US10155760, Example 238::US10351563, Example 238::US10544120, Example 238::US10723734, Example 238::US9902722, Example 238
SMILES CC(C)C[C@](C)(N)COc1cnc(cc1Cl)-c1ccnc(C)c1
InChI Key InChIKey=WDVFYUCKASYYKL-QHCPKHFHSA-N
Data  1 KI  11 IC50
  Tab Delimited (TSV)   2D SDfile   Computed 3D by Vconf -m prep SDfile
Find this compound or compounds like it in BindingDB:
Activity Spreadsheet -- Enzyme Inhibition Constant Data from BindingDB
Found 12 hits for monomerid = 311381
TargetAP2-associated protein kinase 1(Mus musculus)
Bristol-Myers Squibb
Curated by ChEMBL
LigandPNGBDBM311381((S)-1-((4-chloro-2′-methyl-[2,4′-bipyr...)
Affinity DataKi:  0.700nM. Assay description: Displacement of 3H-LP-927443 from AAK1 in C57BL6 mouse brain homogenate assessed as inhibition constant incubated for 1 hr by liquid scintillation co...
Ligand InfoPC cidPC sid
In DepthDetails PubMed
TargetAP2-associated protein kinase 1(Homo sapiens (Human))
Bristol-Myers Squibb
US Patent
LigandPNGBDBM311381((S)-1-((4-chloro-2′-methyl-[2,4′-bipyr...)
Affinity DataIC50:  2.10nM. Assay description: The assays were performed in U-bottom 384-well plates. The final assay volume was 30 μl prepared from 15 μl additions of enzyme and substra...
Ligand InfoPC cidPC sid
In DepthDetails US Patent
TargetAP2-associated protein kinase 1(Homo sapiens (Human))
Bristol-Myers Squibb
US Patent
LigandPNGBDBM311381((S)-1-((4-chloro-2′-methyl-[2,4′-bipyr...)
Affinity DataIC50:  2.10nM. Assay description: The assays were performed in U-bottom 384-well plates. The final assay volume was 30 μl prepared from 15 μl additions of enzyme and substra...
Ligand InfoPC cidPC sid
In DepthDetails US Patent
TargetAP2-associated protein kinase 1(Homo sapiens (Human))
Bristol-Myers Squibb
US Patent
LigandPNGBDBM311381((S)-1-((4-chloro-2′-methyl-[2,4′-bipyr...)
Affinity DataIC50:  2.10nM. Assay description: The assays were performed in U-bottom 384-well plates. The final assay volume was 30 μl prepared from 15 μl additions of enzyme and substra...
Ligand InfoPC cidPC sid
In DepthDetails US Patent
TargetAP2-associated protein kinase 1(Homo sapiens (Human))
Bristol-Myers Squibb
US Patent
LigandPNGBDBM311381((S)-1-((4-chloro-2′-methyl-[2,4′-bipyr...)
Affinity DataIC50:  2.10nM. Assay description: The assays were performed in U-bottom 384-well plates. The final assay volume was 30 Cl prepared from 15 μl additions of enzyme and substrates (...
Ligand InfoPC cidPC sid
In DepthDetails US Patent
TargetCitron Rho-interacting kinase(Homo sapiens (Human))
Bristol-Myers Squibb
Curated by ChEMBL
LigandPNGBDBM311381((S)-1-((4-chloro-2′-methyl-[2,4′-bipyr...)
Affinity DataIC50:  1.30E+3nM. Assay description: Inhibition of CRIK (unknown origin)
Ligand InfoPC cidPC sid
In DepthDetails PubMed
TargetAP2-associated protein kinase 1(Homo sapiens (Human))
Bristol-Myers Squibb
US Patent
LigandPNGBDBM311381((S)-1-((4-chloro-2′-methyl-[2,4′-bipyr...)
Affinity DataIC50:  1.90nM. Assay description: Inhibition of full length human AAK1 expressed in HEK293F cells assessed as suppression of AP2 phosphorylation measured after 3 hrs by Western blot a...
Ligand InfoPC cidPC sid
In DepthDetails PubMed
TargetCytochrome P450 3A4(Homo sapiens (Human))
Bristol-Myers Squibb
Curated by ChEMBL
LigandPNGBDBM311381((S)-1-((4-chloro-2′-methyl-[2,4′-bipyr...)
Affinity DataIC50: >2.00E+4nM. Assay description: Inhibition of CYP3A4 (unknown origin) incubated for 10 mins in presence of NADPH by LC-MS/MS analysis
Ligand InfoPC cidPC sid
In DepthDetails PubMed
TargetBMP-2-inducible protein kinase(Homo sapiens (Human))
Bristol-Myers Squibb
Curated by ChEMBL
LigandPNGBDBM311381((S)-1-((4-chloro-2′-methyl-[2,4′-bipyr...)
Affinity DataIC50:  1.50E+3nM. Assay description: Inhibition of BIKE (unknown origin)
Ligand InfoPC cidPC sid
In DepthDetails PubMed
TargetMAP kinase-interacting serine/threonine-protein kinase 1(Homo sapiens (Human))
Bristol-Myers Squibb
Curated by ChEMBL
LigandPNGBDBM311381((S)-1-((4-chloro-2′-methyl-[2,4′-bipyr...)
Affinity DataIC50:  1.90E+3nM. Assay description: Inhibition of MNK1 (unknown origin)
Ligand InfoPC cidPC sid
In DepthDetails PubMed
TargetAP2-associated protein kinase 1(Homo sapiens (Human))
Bristol-Myers Squibb
US Patent
LigandPNGBDBM311381((S)-1-((4-chloro-2′-methyl-[2,4′-bipyr...)
Affinity DataIC50:  2.10nM. Assay description: The assays were performed in U-bottom 384-well plates. The final assay volume was 30 μl prepared from 15 μl additions of enzyme and substra...
Ligand InfoPC cidPC sid
In DepthDetails US Patent
TargetAP2-associated protein kinase 1(Homo sapiens (Human))
Bristol-Myers Squibb
US Patent
LigandPNGBDBM311381((S)-1-((4-chloro-2′-methyl-[2,4′-bipyr...)
Affinity DataIC50:  2.10nM. Assay description: Inhibition of bacterially expressed GST-Xa-tagged human AAK1 using 5-FAM-labelled Aha-KEEQSQITSQVTGQIGWR-NH2 peptide as substrate incubated for 3 hrs...
Ligand InfoPC cidPC sid
In DepthDetails PubMed