BDBM311865 US10155972, IOmet compound A
SMILES NS(=O)(=O)N1CCC(=CC1)c1c[nH]c2cc(F)ccc12
InChI Key InChIKey=JQVNNQIVDXRAAV-UHFFFAOYSA-N
Data  2 IC50
  Tab Delimited (TSV)   2D SDfile   Computed 3D by Vconf -m prep SDfile
Find this compound or compounds like it in BindingDB:
Activity Spreadsheet -- Enzyme Inhibition Constant Data from BindingDB
Found 2 hits for monomerid = 311865
TargetTryptophan 2,3-dioxygenase(Homo sapiens (Human))
Iomet Pharma
US Patent
LigandPNGBDBM311865(US10155972, IOmet compound A)
Affinity DataIC50: <1.26E+5nM. Assay description: In two separate assays, 0.045 μg/μl of human IDO protein was pre-incubated for 10 min at RT with test compounds NewLink 1 and Incyte 1 in t...
In DepthDetails US Patent
TargetTryptophan 2,3-dioxygenase(Homo sapiens (Human))
Iomet Pharma
US Patent
LigandPNGBDBM311865(US10155972, IOmet compound A)
Affinity DataIC50:  6.31E+3nM. Assay description: In two separate assays, 2.5 μg/μl of human TDO protein was pre-incubated for 10 minutes at RT with test compounds 680C91 and LM10 in the pr...
In DepthDetails US Patent