BDBM31203 spiro-oxindole, 9
SMILES CC(C)(C)C[C@@H]1N[C@@H]([C@@H](c2cccc(Cl)c2F)[C@]11C(=O)Nc2cc(Cl)ccc12)C(=O)NCCN1CCOCC1
InChI Key InChIKey=YTBYOWZWBDYLQF-MHGRFWDASA-N
Data  1 KI
  Tab Delimited (TSV)   2D SDfile   Computed 3D by Vconf -m prep SDfile
Find this compound or compounds like it in BindingDB:
Activity Spreadsheet -- Enzyme Inhibition Constant Data from BindingDB
Found 1 hit for monomerid = 31203
TargetE3 ubiquitin-protein ligase Mdm2(Homo sapiens (Human))
University of Michigan
LigandPNGBDBM31203(spiro-oxindole, 9)
Affinity DataKi:  4.00E+3nM ΔG°:  -7.31kcal/molepH: 7.5 T: 2°C. Assay description: The dose-dependent binding experiments were carried out with serial dilutions of the tested compounds in DMSO. A 5 ul sample of the tested samples an...
In DepthDetails ArticlePubMed