BDBM312090 US9603889, Example 2
SMILES CN[C@@H](C)C(=O)N[C@H](C(=O)N1CC(C[C@H]1C(=O)N[C@@H]1CCCc2ccccc12)NC(=O)c1ccc(CN(CCc2ccccc2)C(=O)[C@@H]2Cc3ccccc3CN2C(=O)[C@@H](NC(=O)[C@H](C)NC)C(C)(C)C)cc1)C(C)(C)C
InChI Key InChIKey=WBECJJFGDUGEEK-NPDPEGIPSA-N
Data  2 IC50
  Tab Delimited (TSV)   2D SDfile   Computed 3D by Vconf -m prep SDfile
Find this compound or compounds like it in BindingDB:
Activity Spreadsheet -- Enzyme Inhibition Constant Data from BindingDB
Found 2 hits for monomerid = 312090
TargetBaculoviral IAP repeat-containing protein 2/E3 ubiquitin-protein ligase XIAP(Homo sapiens (Human))
Bristol-Myers Squibb
US Patent
LigandPNGBDBM312090(US9603889, Example 2)
Affinity DataIC50:  850nM. Assay description: Assays were performed in white, flat-bottom, 384-well ProxiPlates (Perkin Elmer). The final assay volume was 10 μL prepared from additions of Hi...
Ligand InfoPC cidPC sid
In DepthDetails US Patent
TargetBaculoviral IAP repeat-containing protein 3/E3 ubiquitin-protein ligase XIAP(Homo sapiens (Human))
Bristol-Myers Squibb
US Patent
LigandPNGBDBM312090(US9603889, Example 2)
Affinity DataIC50:  30nM. Assay description: Assays were performed in black, flat-bottom, 384-well plates. The final assay volume was 50 μL prepared from additions of N-His-Tb-BIR3(241-356,...
Ligand InfoPC cidPC sid
In DepthDetails US Patent