BDBM312989 US9605022, Example 18
SMILES CN[C@@H](C)C(=O)N[C@H](C(=O)N1CC[C@@H]2[C@H]1C(=O)N[C@@H](Cc1ccc3ccccc3c1)C(=O)N[C@@H](Cc1ccc(OCc3cn(nn3)[C@@H]3CCN([C@@H]3C(=O)N[C@@H](Cc3ccc4ccccc4c3)C(=O)N[C@@H](Cc3ccc(OCc4cn2nn4)cc3)c2nc(=S)o[nH]2)C(=O)[C@@H](NC(=O)[C@H](C)NC)C(C)(C)C)cc1)C(O)=O)C(C)(C)C
InChI Key
Data  1 IC50
  Tab Delimited (TSV)   2D SDfile   Computed 3D by Vconf -m prep SDfile
Find this compound or compounds like it in BindingDB:
Activity Spreadsheet -- Enzyme Inhibition Constant Data from BindingDB
Found 1 hit for monomerid = 312989
TargetBaculoviral IAP repeat-containing protein 2/E3 ubiquitin-protein ligase XIAP(Homo sapiens (Human))
Ensemble Therapeutics
US Patent
LigandPNGBDBM312989(US9605022, Example 18)
Affinity DataIC50:  2.20nM. Assay description: Assays were performed in black, flat-bottom, 384-well plates. The final assay volume was 50 μL prepared from additions of His-BIR2-3 (125-356, C...
Ligand InfoPC cidPC sid
In DepthDetails US Patent