BDBM313418 US10167270, Example 98
SMILES Oc1ccc2CC[C@@H](Cc2c1)Nc1nc(nc2ccccc12)-c1cccnc1
InChI Key InChIKey=QWBKYOWTGUYGRJ-SFHVURJKSA-N
Data  1 IC50
  Tab Delimited (TSV)   2D SDfile   Computed 3D by Vconf -m prep SDfile
Find this compound or compounds like it in BindingDB:
Activity Spreadsheet -- Enzyme Inhibition Constant Data from BindingDB
Found 1 hit for monomerid = 313418
TargetLysosomal acid glucosylceramidase(Homo sapiens (Human))
Northwestern University
US Patent
LigandPNGBDBM313418(US10167270, Example 98)
Affinity DataIC50:  79nM. Assay description: The enzyme in GCase enzyme activity buffer (25 μL/well) was added to a 384-well black plate. The fluorescent probe 3 (25 nL/well, 50 nM final co...
Ligand InfoPC cidPC sid
In DepthDetails US Patent