BDBM313448 US10167270, Example 147
SMILES NCCCCCC(=O)Nc1ccc(cc1)-c1nc(NC2Cc3ccccc3C2)c2ccccc2n1
InChI Key InChIKey=DETOMRKEHILFFF-UHFFFAOYSA-N
Data  1 IC50
  Tab Delimited (TSV)   2D SDfile   Computed 3D by Vconf -m prep SDfile
Find this compound or compounds like it in BindingDB:
Activity Spreadsheet -- Enzyme Inhibition Constant Data from BindingDB
Found 1 hit for monomerid = 313448
TargetLysosomal acid glucosylceramidase(Homo sapiens (Human))
Northwestern University
US Patent
LigandPNGBDBM313448(US10167270, Example 147)
Affinity DataIC50:  7.5nM. Assay description: The enzyme in GCase enzyme activity buffer (25 μL/well) was added to a 384-well black plate. The fluorescent probe 3 (25 nL/well, 50 nM final co...
Ligand InfoPC cidPC sid
In DepthDetails US Patent