BDBM315131 (2R/S)-3-[3-({(2R/S)-2-[4-(5-Chloropyridin-3-yl)phenyl]-2-cyclopentylacetyl}amino)-2-methylphenyl]-2-methylpropanoic acid::US10172814, Example 73::US10172814, Example 74::US10172814, Example 75::US10172814, Example 76::US10172814, Example 77
SMILES CC(Cc1cccc(NC(=O)C(C2CCCC2)c2ccc(cc2)-c2cncc(Cl)c2)c1C)C(O)=O
InChI Key InChIKey=ZKESDPLLYKBBLM-UHFFFAOYSA-N
Data  6 IC50
  Tab Delimited (TSV)   2D SDfile   Computed 3D by Vconf -m prep SDfile
Find this compound or compounds like it in BindingDB:
Activity Spreadsheet -- Enzyme Inhibition Constant Data from BindingDB
Found 6 hits for monomerid = 315131
TargetProstaglandin G/H synthase 2(Homo sapiens (Human))
Bayer Pharma Aktiengesellschaft
US Patent
LigandPNGBDBM315131((2R/S)-3-[3-({(2R/S)-2-[4-(5-Chloropyridin-3-yl)ph...)
Affinity DataIC50:  245nM. Assay description: Recombinant proteins (human isoforms) of PTGES containing a FLAG tag, expressed in baculovirus infected insect cells (Hi-5) and purified by affinity ...
Ligand InfoPC cidPC sid
In DepthDetails US Patent
TargetProstaglandin G/H synthase 2(Homo sapiens (Human))
Bayer Pharma Aktiengesellschaft
US Patent
LigandPNGBDBM315131((2R/S)-3-[3-({(2R/S)-2-[4-(5-Chloropyridin-3-yl)ph...)
Affinity DataIC50:  0.188nM. Assay description: Recombinant proteins (human isoforms) of PTGES containing a FLAG tag, expressed in baculovirus infected insect cells (Hi-5) and purified by affinity ...
Ligand InfoPC cidPC sid
In DepthDetails US Patent
TargetProstaglandin E synthase(Homo sapiens (Human))
Bayer
Curated by ChEMBL
LigandPNGBDBM315131((2R/S)-3-[3-({(2R/S)-2-[4-(5-Chloropyridin-3-yl)ph...)
Affinity DataIC50:  245nM. Assay description: Inhibition of human recombinant FLAG-tagged PTGES expressed in baculovirus infected Hi-5 insect cells using prostaglandin H2 as substrate preincubate...
Ligand InfoPC cidPC sid
In DepthDetails ArticlePubMed
TargetProstaglandin G/H synthase 2(Homo sapiens (Human))
Bayer Pharma Aktiengesellschaft
US Patent
LigandPNGBDBM315131((2R/S)-3-[3-({(2R/S)-2-[4-(5-Chloropyridin-3-yl)ph...)
Affinity DataIC50:  1.62E+4nM. Assay description: Recombinant proteins (human isoforms) of PTGES containing a FLAG tag, expressed in baculovirus infected insect cells (Hi-5) and purified by affinity ...
Ligand InfoPC cidPC sid
In DepthDetails US Patent
TargetProstaglandin G/H synthase 2(Homo sapiens (Human))
Bayer Pharma Aktiengesellschaft
US Patent
LigandPNGBDBM315131((2R/S)-3-[3-({(2R/S)-2-[4-(5-Chloropyridin-3-yl)ph...)
Affinity DataIC50:  127nM. Assay description: Recombinant proteins (human isoforms) of PTGES containing a FLAG tag, expressed in baculovirus infected insect cells (Hi-5) and purified by affinity ...
Ligand InfoPC cidPC sid
In DepthDetails US Patent
TargetProstaglandin G/H synthase 2(Homo sapiens (Human))
Bayer Pharma Aktiengesellschaft
US Patent
LigandPNGBDBM315131((2R/S)-3-[3-({(2R/S)-2-[4-(5-Chloropyridin-3-yl)ph...)
Affinity DataIC50:  71.4nM. Assay description: Recombinant proteins (human isoforms) of PTGES containing a FLAG tag, expressed in baculovirus infected insect cells (Hi-5) and purified by affinity ...
Ligand InfoPC cidPC sid
In DepthDetails US Patent