BDBM315581 US10172859, Example 8::US11065253, Example 8::US9732094, Example 8::[2-Chloro-4-fluoro-5-(7- morpholin-4-yl- quinazolin-4-yl)phenyl]- (6-chloro-4-methoxy- pyridazin-3-yl)methanol1H NMR (500 MHz, DMSO-d6) ppm = 9.13 (s, 1H), 8.01-7.99 (m, 1H), 7.65-7.59 (m, 3H), 7.56 (dd, J = 9.5, 2.5, 1H), 7.22 (d, J = 2.5, 1H), 6.52 (d, J = 6.2, 1H), 6.39 (d, J = 6.2, 1H), 4.02 (s, 3H), 3.80-3.76 (m, 4H), 3.48-3.44 (m, 4H)
SMILES COc1cc(Cl)nnc1C(O)c1cc(c(F)cc1Cl)-c1ncnc2cc(ccc12)N1CCOCC1
InChI Key InChIKey=URDZKJLOZSFJOE-UHFFFAOYSA-N
Data  2 KI  3 IC50
  Tab Delimited (TSV)   2D SDfile   Computed 3D by Vconf -m prep SDfile
Find this compound or compounds like it in BindingDB:
Activity Spreadsheet -- Enzyme Inhibition Constant Data from BindingDB
Found 5 hits for monomerid = 315581
TargetPotassium voltage-gated channel subfamily H member 2(Homo sapiens (Human))
Merck Patent
US Patent
LigandPNGBDBM315581(US10172859, Example 8 | US11065253, Example 8 | US...)
Affinity DataKi:  1.25E+4nM. Assay description: The patch-clamp measurement was carried out at room temperature in whole-cell configuration on human embryonic kidney cells (HEK293) which have been ...
Ligand InfoPC cidPC sid
In DepthDetails US Patent
TargetPotassium voltage-gated channel subfamily H member 2(Homo sapiens (Human))
Merck Patent
US Patent
LigandPNGBDBM315581(US10172859, Example 8 | US11065253, Example 8 | US...)
Affinity DataKi:  1.25E+4nM. Assay description: Method for the detection and characterisation of test substances which interfere with the Kv11.1 (hERG) channel: Kv11.1 (hERG, human ether a-go-go re...
Ligand InfoPC cidPC sid
In DepthDetails US Patent
TargetDNA-dependent protein kinase catalytic subunit(Homo sapiens (Human))
Merck Patent
US Patent
LigandPNGBDBM315581(US10172859, Example 8 | US11065253, Example 8 | US...)
Affinity DataIC50:  18.5nM. Assay description: The kinase assay was carried out in streptavidin-coated 348-well microtitre flashplates. To this end, 1.5 μg of DNA-PK/protein complex and 100 n...
Ligand InfoPC cidPC sid
In DepthDetails US Patent
TargetDNA-dependent protein kinase catalytic subunit(Homo sapiens (Human))
Merck Patent
US Patent
LigandPNGBDBM315581(US10172859, Example 8 | US11065253, Example 8 | US...)
Affinity DataIC50:  18.5nM. Assay description: The kinase assay was carried out in streptavidin-coated 348-well microtitre flashplates. To this end, 1.5 μg of DNA-PK/protein complex and 100 n...
Ligand InfoPC cidPC sid
In DepthDetails US Patent
TargetDNA-dependent protein kinase catalytic subunit(Homo sapiens (Human))
Merck Patent
US Patent
LigandPNGBDBM315581(US10172859, Example 8 | US11065253, Example 8 | US...)
Affinity DataIC50:  19nM. Assay description: The kinase assay was carried out in streptavidin-coated 348-well microtitre flashplates. To this end, 1.5 ug of DNA-PK/protein complex and 100 ng of ...
Ligand InfoPC cidPC sid
In DepthDetails US Patent