BDBM315599 (6-Chloro-3-methoxy- pyrazin-2-yl)-[4-fluoro- 3-(7-morpholin-4-yl- quinazolin-4-yl)phenyl]- methanol1H NMR (500 MHz, DMSO-d6) ppm = 9.11 (s, 1H), 8.30 (s, 1H), 7.65-7.60 (m, 2H), 7.57-7.51 (m, 2H), 7.43-7.36 (m, 1H), 7.22-7.19 (m, 1H), 6.18 (s, 1H), 6.06-6.02 (m, 1H), 3.94 (s, 3H), 3.81- 3.75 (m, 4H), 3.47-3.43 (m, 4H)::US10172859, Example 25::US11065253, Example 25::US9732094, Example 25
SMILES COc1ncc(Cl)nc1C(O)c1ccc(F)c(c1)-c1ncnc2cc(ccc12)N1CCOCC1
InChI Key InChIKey=YRICZHMWIWNYIX-UHFFFAOYSA-N
Data  2 KI  3 IC50
  Tab Delimited (TSV)   2D SDfile   Computed 3D by Vconf -m prep SDfile
Find this compound or compounds like it in BindingDB:
Activity Spreadsheet -- Enzyme Inhibition Constant Data from BindingDB
Found 5 hits for monomerid = 315599
TargetPotassium voltage-gated channel subfamily H member 2(Homo sapiens (Human))
Merck Patent
US Patent
LigandPNGBDBM315599((6-Chloro-3-methoxy- pyrazin-2-yl)-[4-fluoro- 3-(7...)
Affinity DataKi: <1.00E+4nM. Assay description: The patch-clamp measurement was carried out at room temperature in whole-cell configuration on human embryonic kidney cells (HEK293) which have been ...
Ligand InfoPC cidPC sid
In DepthDetails US Patent
TargetPotassium voltage-gated channel subfamily H member 2(Homo sapiens (Human))
Merck Patent
US Patent
LigandPNGBDBM315599((6-Chloro-3-methoxy- pyrazin-2-yl)-[4-fluoro- 3-(7...)
Affinity DataKi: <1.00E+4nM. Assay description: Method for the detection and characterisation of test substances which interfere with the Kv11.1 (hERG) channel: Kv11.1 (hERG, human ether a-go-go re...
Ligand InfoPC cidPC sid
In DepthDetails US Patent
TargetDNA-dependent protein kinase catalytic subunit(Homo sapiens (Human))
Merck Patent
US Patent
LigandPNGBDBM315599((6-Chloro-3-methoxy- pyrazin-2-yl)-[4-fluoro- 3-(7...)
Affinity DataIC50:  5nM. Assay description: The kinase assay was carried out in streptavidin-coated 348-well microtitre flashplates. To this end, 1.5 μg of DNA-PK/protein complex and 100 n...
Ligand InfoPC cidPC sid
In DepthDetails US Patent
TargetDNA-dependent protein kinase catalytic subunit(Homo sapiens (Human))
Merck Patent
US Patent
LigandPNGBDBM315599((6-Chloro-3-methoxy- pyrazin-2-yl)-[4-fluoro- 3-(7...)
Affinity DataIC50:  5nM. Assay description: The kinase assay was carried out in streptavidin-coated 348-well microtitre flashplates. To this end, 1.5 μg of DNA-PK/protein complex and 100 n...
Ligand InfoPC cidPC sid
In DepthDetails US Patent
TargetDNA-dependent protein kinase catalytic subunit(Homo sapiens (Human))
Merck Patent
US Patent
LigandPNGBDBM315599((6-Chloro-3-methoxy- pyrazin-2-yl)-[4-fluoro- 3-(7...)
Affinity DataIC50:  5nM. Assay description: The kinase assay was carried out in streptavidin-coated 348-well microtitre flashplates. To this end, 1.5 ug of DNA-PK/protein complex and 100 ng of ...
Ligand InfoPC cidPC sid
In DepthDetails US Patent