BDBM315760 US10172859, Example 181::US11065253, Example 181::US9732094, Example 181::[2-Chloro-4-fluoro- 5-(7-morpholin-4-yl- quinazolin-4-yl)- phenyl]-(4-methyl- thiazol-2-yl)- methanol1H NMR (500 MHz, DMSO-d6) ppm = 9.10 (s,1H), 7.73 (dd, J = 10.5, 8.6, 2H), 7.57-7.51 (m,2H), 7.22-7.18 (m, 2H), 6.97 (s, 1H), 6.26 (s,1H), 3.80-3.74 (m, 4H), 3.49-3.41 (m, 4H),2.30 (d, J = 1.0, 3H)
SMILES Cc1csc(n1)C(O)c1cc(c(F)cc1Cl)-c1ncnc2cc(ccc12)N1CCOCC1
InChI Key InChIKey=ZNMXTDAANBXETP-UHFFFAOYSA-N
Data  2 KI  3 IC50
  Tab Delimited (TSV)   2D SDfile   Computed 3D by Vconf -m prep SDfile
Find this compound or compounds like it in BindingDB:
Activity Spreadsheet -- Enzyme Inhibition Constant Data from BindingDB
Found 5 hits for monomerid = 315760
TargetPotassium voltage-gated channel subfamily H member 2(Homo sapiens (Human))
Merck Patent
US Patent
LigandPNGBDBM315760(US10172859, Example 181 | US11065253, Example 181 ...)
Affinity DataKi: <1.00E+4nM. Assay description: The patch-clamp measurement was carried out at room temperature in whole-cell configuration on human embryonic kidney cells (HEK293) which have been ...
Ligand InfoPC cidPC sid
In DepthDetails US Patent
TargetPotassium voltage-gated channel subfamily H member 2(Homo sapiens (Human))
Merck Patent
US Patent
LigandPNGBDBM315760(US10172859, Example 181 | US11065253, Example 181 ...)
Affinity DataKi: <1.00E+4nM. Assay description: Method for the detection and characterisation of test substances which interfere with the Kv11.1 (hERG) channel: Kv11.1 (hERG, human ether a-go-go re...
Ligand InfoPC cidPC sid
In DepthDetails US Patent
TargetDNA-dependent protein kinase catalytic subunit(Homo sapiens (Human))
Merck Patent
US Patent
LigandPNGBDBM315760(US10172859, Example 181 | US11065253, Example 181 ...)
Affinity DataIC50: <3nM. Assay description: The kinase assay was carried out in streptavidin-coated 348-well microtitre flashplates. To this end, 1.5 μg of DNA-PK/protein complex and 100 n...
Ligand InfoPC cidPC sid
In DepthDetails US Patent
TargetDNA-dependent protein kinase catalytic subunit(Homo sapiens (Human))
Merck Patent
US Patent
LigandPNGBDBM315760(US10172859, Example 181 | US11065253, Example 181 ...)
Affinity DataIC50: <3nM. Assay description: The kinase assay was carried out in streptavidin-coated 348-well microtitre flashplates. To this end, 1.5 μg of DNA-PK/protein complex and 100 n...
Ligand InfoPC cidPC sid
In DepthDetails US Patent
TargetDNA-dependent protein kinase catalytic subunit(Homo sapiens (Human))
Merck Patent
US Patent
LigandPNGBDBM315760(US10172859, Example 181 | US11065253, Example 181 ...)
Affinity DataIC50: <3nM. Assay description: The kinase assay was carried out in streptavidin-coated 348-well microtitre flashplates. To this end, 1.5 ug of DNA-PK/protein complex and 100 ng of ...
Ligand InfoPC cidPC sid
In DepthDetails US Patent