BDBM316025 US10172859, Example 448::US11065253, Example 448::US9732094, Example 448::[2,4-Difluoro-5-(7- morpholin-4-yl- quinazolin-4-yl)- phenyl]-(5-methoxy- pyrimidin-4-yl)- methanol1H NMR (400 MHz, DMSO-d6) ppm = 9.11 (s,1H), 8.77 (s, 1H), 8.62 (s, 1H), 7.86 (t, J = 8.2,1H), 7.66-7.50 (m, 2H), 7.41 (t, J = 10.1, 1H),7.21 (d, J = 2.1, 1H), 6.32 (d, J = 6.2, 1H), 6.25 (d,J = 6.3, 1H), 3.97 (s, 3H), 3.78 (t, J = 4.9, 4H), 3.45(t, J = 4.9, 4H).
SMILES COc1cncnc1C(O)c1cc(c(F)cc1F)-c1ncnc2cc(ccc12)N1CCOCC1
InChI Key InChIKey=MYZXVIJFUGZRRE-UHFFFAOYSA-N
Data  2 KI  3 IC50
  Tab Delimited (TSV)   2D SDfile   Computed 3D by Vconf -m prep SDfile
Find this compound or compounds like it in BindingDB:
Activity Spreadsheet -- Enzyme Inhibition Constant Data from BindingDB
Found 5 hits for monomerid = 316025
TargetPotassium voltage-gated channel subfamily H member 2(Homo sapiens (Human))
Merck Patent
US Patent
LigandPNGBDBM316025(US10172859, Example 448 | US11065253, Example 448 ...)
Affinity DataKi:  1.25E+4nM. Assay description: The patch-clamp measurement was carried out at room temperature in whole-cell configuration on human embryonic kidney cells (HEK293) which have been ...
Ligand InfoPC cidPC sid
In DepthDetails US Patent
TargetPotassium voltage-gated channel subfamily H member 2(Homo sapiens (Human))
Merck Patent
US Patent
LigandPNGBDBM316025(US10172859, Example 448 | US11065253, Example 448 ...)
Affinity DataKi:  1.25E+4nM. Assay description: Method for the detection and characterisation of test substances which interfere with the Kv11.1 (hERG) channel: Kv11.1 (hERG, human ether a-go-go re...
Ligand InfoPC cidPC sid
In DepthDetails US Patent
TargetDNA-dependent protein kinase catalytic subunit(Homo sapiens (Human))
Merck Patent
US Patent
LigandPNGBDBM316025(US10172859, Example 448 | US11065253, Example 448 ...)
Affinity DataIC50: <3nM. Assay description: The kinase assay was carried out in streptavidin-coated 348-well microtitre flashplates. To this end, 1.5 μg of DNA-PK/protein complex and 100 n...
Ligand InfoPC cidPC sid
In DepthDetails US Patent
TargetDNA-dependent protein kinase catalytic subunit(Homo sapiens (Human))
Merck Patent
US Patent
LigandPNGBDBM316025(US10172859, Example 448 | US11065253, Example 448 ...)
Affinity DataIC50: <3nM. Assay description: The kinase assay was carried out in streptavidin-coated 348-well microtitre flashplates. To this end, 1.5 μg of DNA-PK/protein complex and 100 n...
Ligand InfoPC cidPC sid
In DepthDetails US Patent
TargetDNA-dependent protein kinase catalytic subunit(Homo sapiens (Human))
Merck Patent
US Patent
LigandPNGBDBM316025(US10172859, Example 448 | US11065253, Example 448 ...)
Affinity DataIC50: <3nM. Assay description: The kinase assay was carried out in streptavidin-coated 348-well microtitre flashplates. To this end, 1.5 ug of DNA-PK/protein complex and 100 ng of ...
Ligand InfoPC cidPC sid
In DepthDetails US Patent