BDBM316068 US9616064, Compound 1be
SMILES COc1cccc(Nc2ccnc(N)n2)c1
InChI Key InChIKey=FMDMHVCGZQRZEJ-UHFFFAOYSA-N
Data  2 IC50
  Tab Delimited (TSV)   2D SDfile   Computed 3D by Vconf -m prep SDfile
Find this compound or compounds like it in BindingDB:
Activity Spreadsheet -- Enzyme Inhibition Constant Data from BindingDB
Found 2 hits for monomerid = 316068
TargetRho-associated protein kinase 2(Homo sapiens (Human))
H. Lee Moffitt Cancer Center and Research Institute
US Patent
LigandPNGBDBM316068(US9616064, Compound 1be)
Affinity DataIC50:  4.25E+4nM
Ligand InfoPC cidPC sid
In DepthDetails US Patent
TargetRho-associated protein kinase 1(Homo sapiens (Human))
H. Lee Moffitt Cancer Center and Research Institute
US Patent
LigandPNGBDBM316068(US9616064, Compound 1be)
Affinity DataIC50:  3.02E+4nM. Assay description: The inventors undertook a screen of the NCI Diversity set using a Z-lyte FRET assay (Kang et al. (2009); Wu et al. (2010)) to measure kinase inhibiti...
Ligand InfoPC cidPC sid
In DepthDetails US Patent