BDBM316208 N-(3-(benzyloxy)-4-methoxyphenyl)-6-(2-methoxyphenyl)pyrimidin-4-amine::US10294218, Example 36::US9617225, Example 36
SMILES COc1ccc(Nc2cc(ncn2)-c2ccccc2OC)cc1OCc1ccccc1
InChI Key InChIKey=UAPBPOHZYCCAHI-UHFFFAOYSA-N
Data  2 IC50
  Tab Delimited (TSV)   2D SDfile   Computed 3D by Vconf -m prep SDfile
Find this compound or compounds like it in BindingDB:
Activity Spreadsheet -- Enzyme Inhibition Constant Data from BindingDB
Found 2 hits for monomerid = 316208
TargetCyclin-T1/Cyclin-dependent kinase 9(Homo sapiens (Human))
Virostatics
US Patent
LigandPNGBDBM316208(N-(3-(benzyloxy)-4-methoxyphenyl)-6-(2-methoxyphen...)
Affinity DataIC50: <1.00E+4nM. Assay description: The activity of the compounds described in the present invention can be determined by measuring the phosphorylation of a fluorescently-labeled peptid...
Ligand InfoPC cidPC sid
In DepthDetails US Patent
TargetCyclin-dependent kinase 9(Homo sapiens (Human))
Virostatics
US Patent
LigandPNGBDBM316208(N-(3-(benzyloxy)-4-methoxyphenyl)-6-(2-methoxyphen...)
Affinity DataIC50: <1.00E+4nM. Assay description: The activity of the compounds described in the present invention can be determined by measuring the phosphorylation of a fluorescently-labeled peptid...
Ligand InfoPC cidPC sid
In DepthDetails US Patent