BDBM317520 6-methoxy-3-{[(2-methylquinolin-6-yl)amino]methyl}-1,2-dihydroquinolin-2-one::US9624175, Compound I-35
SMILES COc1ccc2[nH]c(=O)c(CNc3ccc4nc(C)ccc4c3)cc2c1
InChI Key InChIKey=JVYCHBLRCJHCGO-UHFFFAOYSA-N
Data  1 IC50
  Tab Delimited (TSV)   2D SDfile   Computed 3D by Vconf -m prep SDfile
Find this compound or compounds like it in BindingDB:
Activity Spreadsheet -- Enzyme Inhibition Constant Data from BindingDB
Found 1 hit for monomerid = 317520
TargetIsocitrate dehydrogenase [NADP] cytoplasmic [R132H](Homo sapiens (Human))
Forma Therapeutics
US Patent
LigandPNGBDBM317520(6-methoxy-3-{[(2-methylquinolin-6-yl)amino]methyl}...)
Affinity DataIC50: >1.00E+4nM. Assay description: Assays were performed in a 384-well black plate. An aliquot of 250 nL of compound was incubated with 10 μL of 30 nM IDH1-R132H or 10 nM IDH1-R13...
Ligand InfoPC cidPC sid
In DepthDetails US Patent