BDBM317527 3-[(1S)-1-({1-acetyl-1H,2H,3H-pyrrolo[3,2-c]pyridin-4-yl}amino)ethyl]-6-chloro-1,2-dihydroquinolin-2-one::US9624175, Compound I-42
SMILES C[C@H](Nc1nccc2N(CCc12)C(C)=O)c1cc2cc(Cl)ccc2[nH]c1=O
InChI Key
Data  2 IC50
  Tab Delimited (TSV)   2D SDfile   Computed 3D by Vconf -m prep SDfile
Find this compound or compounds like it in BindingDB:
Activity Spreadsheet -- Enzyme Inhibition Constant Data from BindingDB
Found 2 hits for monomerid = 317527
TargetIsocitrate dehydrogenase [NADP] cytoplasmic [1-390,401-414,R132C](Homo sapiens (Human))
Forma Therapeutics
US Patent
LigandPNGBDBM317527(3-[(1S)-1-({1-acetyl-1H,2H,3H-pyrrolo[3,2-c]pyridi...)
Affinity DataIC50:  5.50E+3nM
Ligand InfoPC cidPC sid
In DepthDetails US Patent
TargetIsocitrate dehydrogenase [NADP] cytoplasmic [R132H](Homo sapiens (Human))
Forma Therapeutics
US Patent
LigandPNGBDBM317527(3-[(1S)-1-({1-acetyl-1H,2H,3H-pyrrolo[3,2-c]pyridi...)
Affinity DataIC50:  550nM. Assay description: Assays were performed in a 384-well black plate. An aliquot of 250 nL of compound was incubated with 10 μL of 30 nM IDH1-R132H or 10 nM IDH1-R13...
Ligand InfoPC cidPC sid
In DepthDetails US Patent