BDBM317532 6-chloro-3-[(1S)-1-({1-methyl-2-oxo-1H,2H,4H-pyrimido[4,5-d][1,3]oxazin-7-yl}amino)ethyl]-1,2-dihydroquinolin-2-one::US9624175, Compound I-47
SMILES C[C@H](Nc1ncc2COC(=O)N(C)c2n1)c1cc2cc(Cl)ccc2[nH]c1=O
InChI Key
Data  2 IC50
  Tab Delimited (TSV)   2D SDfile   Computed 3D by Vconf -m prep SDfile
Find this compound or compounds like it in BindingDB:
Activity Spreadsheet -- Enzyme Inhibition Constant Data from BindingDB
Found 2 hits for monomerid = 317532
TargetIsocitrate dehydrogenase [NADP] cytoplasmic [1-390,401-414,R132C](Homo sapiens (Human))
Forma Therapeutics
US Patent
LigandPNGBDBM317532(6-chloro-3-[(1S)-1-({1-methyl-2-oxo-1H,2H,4H-pyrim...)
Affinity DataIC50: <100nM
Ligand InfoPC cidPC sid
In DepthDetails US Patent
TargetIsocitrate dehydrogenase [NADP] cytoplasmic [R132H](Homo sapiens (Human))
Forma Therapeutics
US Patent
LigandPNGBDBM317532(6-chloro-3-[(1S)-1-({1-methyl-2-oxo-1H,2H,4H-pyrim...)
Affinity DataIC50: <100nM. Assay description: Assays were performed in a 384-well black plate. An aliquot of 250 nL of compound was incubated with 10 μL of 30 nM IDH1-R132H or 10 nM IDH1-R13...
Ligand InfoPC cidPC sid
In DepthDetails US Patent