BDBM317550 (r)-3-(4-(diisobutylamino)-3-(3-(pyrimidin-5-yl)ureido)phenyl)butanoic acid::US9624188, 37
SMILES CC(C)CN(CC(C)C)c1ccc(cc1NC(=O)Nc1cncnc1)[C@H](C)CC(O)=O
InChI Key InChIKey=LJCAFMSKDUEZRV-QGZVFWFLSA-N
Data  1 IC50
  Tab Delimited (TSV)   2D SDfile   Computed 3D by Vconf -m prep SDfile
Find this compound or compounds like it in BindingDB:
Activity Spreadsheet -- Enzyme Inhibition Constant Data from BindingDB
Found 1 hit for monomerid = 317550
TargetIndoleamine 2,3-dioxygenase 1(Homo sapiens (Human))
Bristol-Myers Squibb
US Patent
LigandPNGBDBM317550((r)-3-(4-(diisobutylamino)-3-(3-(pyrimidin-5-yl)ur...)
Affinity DataIC50:  11nM. Assay description: Human IDO1/HEK293 cells were seeded at 10,000 cells per 50 uL per well with RPMI/phenol red free media contains 10% FBS in a 384-well black wall clea...
Ligand InfoPC cidPC sid
In DepthDetails US Patent