BDBM317554 (s)-3-(4-(diisobutylamino)-3-(3-(p-tolyl)ureido)phenyl)butanoic acid::US9624188, 43
SMILES CC(C)CN(CC(C)C)c1ccc(cc1NC(=O)Nc1ccc(C)cc1)[C@@H](C)CC(O)=O
InChI Key InChIKey=XNEMYXGEMLLQOO-FQEVSTJZSA-N
Data  1 IC50
  Tab Delimited (TSV)   2D SDfile   Computed 3D by Vconf -m prep SDfile
Find this compound or compounds like it in BindingDB:
Activity Spreadsheet -- Enzyme Inhibition Constant Data from BindingDB
Found 1 hit for monomerid = 317554
TargetIndoleamine 2,3-dioxygenase 1(Homo sapiens (Human))
Bristol-Myers Squibb
US Patent
LigandPNGBDBM317554((s)-3-(4-(diisobutylamino)-3-(3-(p-tolyl)ureido)ph...)
Affinity DataIC50:  17nM. Assay description: Human IDO1/HEK293 cells were seeded at 10,000 cells per 50 uL per well with RPMI/phenol red free media contains 10% FBS in a 384-well black wall clea...
Ligand InfoPC cidPC sid
In DepthDetails US Patent